Target
11-beta-hydroxysteroid dehydrogenase 1
Ligand
BDBM250497
Substrate
Meas. Tech.
HTRF Assay
pH
6±n/a
Temperature
298.15±n/a K
IC50
62.1±n/a nM
Comments
extracted
Citation
 Ahn, SKAuh, JChoi, NSHan, CKKim, TPae, KShin, YJHan, DHan, CK Compound having ability to inhibit 11Beta-HSD1 enzyme or pharmaceutically acceptable salt thereof, method for producing same, and pharmaceutical composition containing same as active ingredient US Patent  US9464044 Publication Date 10/11/2016 
Target
Name:
11-beta-hydroxysteroid dehydrogenase 1
Synonyms:
11-DH 11-beta-Hydroxysteroid Dehydrogenase 1 (11-beta-HSD1) 11-beta-hydroxysteroid dehydrogenase 1 (11HSD1) Corticosteroid 11-beta-dehydrogenase isozyme 1 (11-beta-HSD-1) Corticosteroid 11-beta-dehydrogenase isozyme 1 (11beta-HSD1) HSD11 HSD11L | SDR26C1
Type:
Enzyme
Mol. Mass.:
32409.16
Organism:
Homo sapiens (Human)
Description:
P28845
Residue:
292
  
Inhibitor
Name:
BDBM250497
Synonyms:
US9464044, 138
Type:
Small organic molecule
Emp. Form.:
C21H27N3O4S
Mol. Mass.:
417.522
SMILES:
NC(=O)C12CC3CC(C1)[C@H](NC(=O)c1cccc(NS(=O)(=O)C4CC4)c1)C(C3)C2
: