Target
Amine oxidase [flavin-containing] A
Ligand
BDBM256646
Substrate
Meas. Tech.
Inhibitory Activity Assay
pH
7.5±n/a
Temperature
298.15±n/a K
IC50
>100000±n/a nM
Comments
extracted
Citation
 Matsumoto, SHattori, YToyofuku, MMorimoto, SDaini, MKojima, TKaku, TIto, M Cyclopropanamine compound and use thereof US Patent  US9487511 Publication Date 11/8/2016 
Target
Name:
Amine oxidase [flavin-containing] A
Synonyms:
AOFA_HUMAN MAO-A Monoamine oxidase Monoamine oxidase type A (MAO A) Monoamine oxidase type A (MAOA)
Type:
Protein
Mol. Mass.:
59689.53
Organism:
Homo sapiens (Human)
Description:
P21397
Residue:
527
  
Inhibitor
Name:
BDBM256646
Synonyms:
US10053456, 25 US10968213, Example 25 US9718814, 25 | US9920047, 25
Type:
Small organic molecule
Emp. Form.:
C13H16N4OS
Mol. Mass.:
276.357
SMILES:
Cc1sc(cc1C1CC1N)C(=O)Nc1cnn(C)c1
: