Target
D-amino-acid oxidase
Ligand
BDBM258353
Substrate
Meas. Tech.
In Vitro Assay
pH
8.5±n/a
Temperature
298.15±n/a K
IC50
5000±n/a nM
Comments
extracted
Citation
 Tsukamoto, TSlusher, BSFerraris, DVRojas, CHin, NDuvall, B Inhibitors of D-amino acid oxidase US Patent  US9505753 Publication Date 11/29/2016 
Target
Name:
D-amino-acid oxidase
Synonyms:
D-amino-acid oxidase (DAAO) DAMOX OXDA_HUMAN
Type:
Homodimer
Mol. Mass.:
39476.06
Organism:
Homo sapiens (Human)
Description:
P14920
Residue:
347
  
Inhibitor
Name:
BDBM258353
Synonyms:
US9505753, 12a
Type:
Small organic molecule
Emp. Form.:
C7H12N4O3
Mol. Mass.:
200.1952
SMILES:
CN(C)CCn1nc(O)c(=O)[nH]c1=O
: