Target
Nuclear receptor ROR-gamma
Ligand
BDBM310126
Substrate
Meas. Tech.
RORgamma-Ligand Binding Domain TR-FRET Assay Protocol II
EC50
18.0±n/a nM
Citation
 Aicher, TDBarr, KJLapointe, BTSimov, VStein, KAThomas, WDToogood, PLVan Huis, CAWhite, CM Tetrahydronaphthyridine and related bicyclic compounds for inhibition of RORgamma activity and the treatment of disease US Patent  US10377768 Publication Date 8/13/2019 
Target
Name:
Nuclear receptor ROR-gamma
Synonyms:
NR1F3 Nuclear receptor ROR-gamma (RORC) RAR-related orphan receptor C (RORc) RORG RZRG Retinoid-related orphan receptor-gamma (RORc)
Type:
Enzyme Catalytic Domain
Mol. Mass.:
58218.40
Organism:
Homo sapiens (Human)
Description:
P51449
Residue:
518
  
Inhibitor
Name:
BDBM310126
Synonyms:
(R)-N-(7-amino-5-(m-tolylsulfonyl)-5,6,7,8-tetrahydro-1,5-naphthyridin-3-yl)-2,6-dichlorobenzamide trifluoroacetic acid salt US9657033, Compound 40
Type:
Small organic molecule
Emp. Form.:
C22H20Cl2N4O3S
Mol. Mass.:
491.39
SMILES:
Cc1cccc(c1)S(=O)(=O)N1C[C@H](N)Cc2ncc(NC(=O)c3c(Cl)cccc3Cl)cc12
: