Target
Cyclin-dependent kinase 4/G1/S-specific cyclin-D1
Ligand
BDBM6829
Substrate
Rb(21)
Meas. Tech.
CDK Kinase Inhibition Assay
Temperature
298.15±n/a K
IC50
21±n/a nM
Comments
extracted
Citation
 Engler, TAFurness, KMalhotra, SSanchez-Martinez, CShih, CXie, WZhu, GZhou, XConner, SFaul, MMSullivan, KAKolis, SPBrooks, HBPatel, BSchultz, RMDeHahn, TBKirmani, KSpencer, CDWatkins, SAConsidine, ELDempsey, JAOgg, CAStamm, NBAnderson, BDCampbell, RMVasudevan, VLytle, ML Novel, potent and selective cyclin D1/CDK4 inhibitors: indolo[6,7-a]pyrrolo[3,4-c]carbazoles. Bioorg Med Chem Lett 13:2261-7 (2003)  
Target
Name:
Cyclin-dependent kinase 4/G1/S-specific cyclin-D1
Synonyms:
CDK4/CycD CDK4/Cyclin D1 Cyclin-Dependent Kinase 4 (CDK4) Cyclin-dependent kinase 4/G1/S-specific cyclin D1 | Cyclin-dependent kinase 4/cyclin D1
Type:
Protein Complex
Mol. Mass.:
Description:
CDK4/D1 complexes were purified from insect cells co-infected with baculovirus vectors containing each of the components.
Components:
This complex has 2 components.
Component 1
Name:
Cyclin-dependent kinase 4
Synonyms:
CDK4 Cell division protein kinase 4 PSK-J3
Type:
Enzyme Subunit
Mol. Mass.:
33731.96
Organism:
Homo sapiens (Human)
Description:
P11802
Residue:
303
  
Component 2
Name:
G1/S-specific cyclin-D1
Synonyms:
B-cell lymphoma 1 protein BCL-1 oncogene CCND1 PRAD1 | PRAD1 oncogene
Type:
Enzyme Subunit
Mol. Mass.:
33717.70
Organism:
Homo sapiens (Human)
Description:
Residue:
295
  
Inhibitor
Name:
BDBM6829
Synonyms:
3-{2-[(2-hydroxyethyl)amino]ethyl}-6-methoxy-18-methyl-3,13,18-triazahexacyclo[14.7.0.0^{2,10}.0^{4,9}.0^{11,15}.0^{17,21}]tricosa-1(16),2(10),4(9),5,7,11(15),17(21),19,22-nonaene-12,14-dione | indolocarbazole deriv. 11h
Type:
Small organic molecule
Emp. Form.:
C26H24N4O4
Mol. Mass.:
456.4932
SMILES:
COc1ccc2c(c1)n(CCNCCO)c1c2c2C(=O)NC(=O)c2c2c3n(C)ccc3ccc12
:
Substrate
Name:
Rb(21)
Synonyms:
C-terminal retinoblastoma protein RB_HUMAN
Type:
Other Protein Type
Mol. Mass.:
17129.60
Organism:
Homo sapiens (Human)
Description:
Amino acids 769-921 of human retinoblastoma 1.
Residue:
153