Target
Amine oxidase [flavin-containing] A
Ligand
BDBM243415
Substrate
Meas. Tech.
Inhibition Activity Assay
IC50
>100000±n/a nM
Citation
 Matsumoto, SHattori, YToyofuku, MMorimoto, SDaini, MKojima, TKaku, TIto, M Cyclopropanamine compound and use thereof US Patent  US10414761 Publication Date 9/17/2019 
Target
Name:
Amine oxidase [flavin-containing] A
Synonyms:
AOFA_HUMAN MAO-A Monoamine oxidase Monoamine oxidase type A (MAO A) Monoamine oxidase type A (MAOA)
Type:
Protein
Mol. Mass.:
59689.53
Organism:
Homo sapiens (Human)
Description:
P21397
Residue:
527
  
Inhibitor
Name:
BDBM243415
Synonyms:
N-(5-methyl-1,3,4- thiadiazol-2-yl)-5- ((1R,2R)-2- (tetrahydro-2H- pyran-4-ylamino)- cyclopropyl)thio- phene-3-carboxamide US10414761, Example 49 US9718814, 49 | US9920047, 49
Type:
Small organic molecule
Emp. Form.:
C16H20N4O2S2
Mol. Mass.:
364.486
SMILES:
Cc1nnc(NC(=O)c2csc(c2)[C@@H]2C[C@H]2NC2CCOCC2)s1
: