Target
Coagulation factor XI
Ligand
BDBM413610
Substrate
Meas. Tech.
Inhibition Assay
IC50
0.400±n/a nM
Citation
 Jimenez Nunez, EAckerstaff, JRöhrig, SHillisch, AMeier, KHeitmeier, STersteegen, AStampfuß, JEllerbrock, PMeibom, DLang, D Substituted oxopyridine derivatives US Patent  US10421742 Publication Date 9/24/2019 
Target
Name:
Coagulation factor XI
Synonyms:
Coagulation factor XIa Coagulation factor XIa light chain FA11_HUMAN Factor XIa PTA | Plasma thromboplastin antecedent
Type:
Enzyme
Mol. Mass.:
70130.58
Organism:
Homo sapiens (Human)
Description:
P03951
Residue:
625
  
Inhibitor
Name:
BDBM413610
Synonyms:
4-{[(2S)-2-{4-[5-Chloro-2-(1,3-oxazol-5-yl)phenyl]-5-methoxy-2-oxopyridin-1(2H)-yl}-4-methoxybutanoyl]amino}benzoic acid (Enantiomer 2) US11180471, Example 7
Type:
Small organic molecule
Emp. Form.:
C27H24ClN3O7
Mol. Mass.:
537.948
SMILES:
COCC[C@@H](C(=O)Nc1ccc(cc1)C(O)=O)n1cc(OC)c(cc1=O)-c1cc(Cl)ccc1-c1cnco1
: