Target
Coagulation factor XI
Ligand
BDBM413727
Substrate
Meas. Tech.
Inhibition Assay
IC50
0.340±n/a nM
Citation
 Jimenez Nunez, EAckerstaff, JRöhrig, SHillisch, AMeier, KHeitmeier, STersteegen, AStampfuß, JEllerbrock, PMeibom, DLang, D Substituted oxopyridine derivatives US Patent  US10421742 Publication Date 9/24/2019 
Target
Name:
Coagulation factor XI
Synonyms:
Coagulation factor XIa Coagulation factor XIa light chain FA11_HUMAN Factor XIa PTA | Plasma thromboplastin antecedent
Type:
Enzyme
Mol. Mass.:
70130.58
Organism:
Homo sapiens (Human)
Description:
P03951
Residue:
625
  
Inhibitor
Name:
BDBM413727
Synonyms:
(2S)-2-{4-[5-Chloro-2-(1H-tetrazol-1-yl)phenyl]-5-methoxy-2-oxopyridin-1(2H)-yl}-N-(2-methyl-2H-indazol-5-yl)pentanamide (Enantiomer 2) US11180471, Example 120
Type:
Small organic molecule
Emp. Form.:
C26H25ClN8O3
Mol. Mass.:
532.982
SMILES:
CCC[C@@H](C(=O)Nc1ccc2nn(C)cc2c1)n1cc(OC)c(cc1=O)-c1cc(Cl)ccc1-n1cnnn1
: