Target
Proto-oncogene tyrosine-protein kinase receptor Ret [658-1114,V804M]
Ligand
BDBM305171
Substrate
Meas. Tech.
RET Enzyme Assay
IC50
5.00±n/a nM
Citation
 Andrews, SWAronow, SBlake, JFBrandhuber, BJCollier, JCook, AHaas, JJiang, YKolakowski, GRMcFaddin, EAMcKenney, MLMcNulty, OTMetcalf, ATMoreno, DARamann, GATang, TPRen, LWalls, SM Substituted pyrazolo[1,5-A]pyridine compounds as RET kinase inhibitors US Patent  US10441581 Publication Date 10/15/2019 
Target
Name:
Proto-oncogene tyrosine-protein kinase receptor Ret [658-1114,V804M]
Synonyms:
CDHF12 PTC Proto-oncogene tyrosine-protein kinase receptor Ret (V804M) RET Kinase (V804M) (aa658-end) RET_HUMAN
Type:
Enzyme Catalytic Domain
Mol. Mass.:
51567.23
Organism:
Homo sapiens (Human)
Description:
P07949[658-1114,V804M]
Residue:
457
  
Inhibitor
Name:
BDBM305171
Synonyms:
4-(6-(3-(3,5- difluorophenoxy)azetidin- 1-yl)pyridin-3-yl)-6-(2- hydroxy-2- methylpropoxy)pyrazolo [1,5-a]pyridine-3- carbonitrile US10172845, Example 187 US10881652, Example 187 | US11648243, Example 187
Type:
Small organic molecule
Emp. Form.:
C26H23F2N5O3
Mol. Mass.:
491.4893
SMILES:
CC(C)(O)COc1cc(-c2ccc(nc2)N2CC(C2)Oc2cc(F)cc(F)c2)c2c(cnn2c1)C#N
: