Target
Proto-oncogene tyrosine-protein kinase receptor Ret [658-1114,V804M]
Ligand
BDBM305285
Substrate
Meas. Tech.
RET Enzyme Assay
IC50
6.10±n/a nM
Citation
 Andrews, SWAronow, SBlake, JFBrandhuber, BJCollier, JCook, AHaas, JJiang, YKolakowski, GRMcFaddin, EAMcKenney, MLMcNulty, OTMetcalf, ATMoreno, DARamann, GATang, TPRen, LWalls, SM Substituted pyrazolo[1,5-A]pyridine compounds as RET kinase inhibitors US Patent  US10441581 Publication Date 10/15/2019 
Target
Name:
Proto-oncogene tyrosine-protein kinase receptor Ret [658-1114,V804M]
Synonyms:
CDHF12 PTC Proto-oncogene tyrosine-protein kinase receptor Ret (V804M) RET Kinase (V804M) (aa658-end) RET_HUMAN
Type:
Enzyme Catalytic Domain
Mol. Mass.:
51567.23
Organism:
Homo sapiens (Human)
Description:
P07949[658-1114,V804M]
Residue:
457
  
Inhibitor
Name:
BDBM305285
Synonyms:
US10144734, Example 301 US10441581, Example 301 US11648243, Example 301
Type:
Small organic molecule
Emp. Form.:
C28H27FN6O2
Mol. Mass.:
498.5514
SMILES:
COc1cc(-c2ccc(nc2)N2CCC(C)(CC2)NC(=O)c2cc(F)ccc2C)c2c(cnn2c1)C#N
: