Target
Proto-oncogene tyrosine-protein kinase receptor Ret [658-1114,V804M]
Ligand
BDBM305368
Substrate
Meas. Tech.
RET Enzyme Assay
IC50
5.80±n/a nM
Citation
 Andrews, SWAronow, SBlake, JFBrandhuber, BJCollier, JCook, AHaas, JJiang, YKolakowski, GRMcFaddin, EAMcKenney, MLMcNulty, OTMetcalf, ATMoreno, DARamann, GATang, TPRen, LWalls, SM Substituted pyrazolo[1,5-A]pyridine compounds as RET kinase inhibitors US Patent  US10441581 Publication Date 10/15/2019 
Target
Name:
Proto-oncogene tyrosine-protein kinase receptor Ret [658-1114,V804M]
Synonyms:
CDHF12 PTC Proto-oncogene tyrosine-protein kinase receptor Ret (V804M) RET Kinase (V804M) (aa658-end) RET_HUMAN
Type:
Enzyme Catalytic Domain
Mol. Mass.:
51567.23
Organism:
Homo sapiens (Human)
Description:
P07949[658-1114,V804M]
Residue:
457
  
Inhibitor
Name:
BDBM305368
Synonyms:
US10144734, Example 385 US10441581, Example 385 US11648243, Example 385
Type:
Small organic molecule
Emp. Form.:
C28H37N7O2
Mol. Mass.:
503.6391
SMILES:
CCOc1cc(-c2ccc(nc2)N2CCC(CN(C)C)(CC2)NC(=O)CC(C)C)c2c(cnn2c1)C#N
: