Target
Proto-oncogene tyrosine-protein kinase receptor Ret [658-1114,V804M]
Ligand
BDBM305398
Substrate
Meas. Tech.
RET Enzyme Assay
IC50
6.90±n/a nM
Citation
 Andrews, SWAronow, SBlake, JFBrandhuber, BJCollier, JCook, AHaas, JJiang, YKolakowski, GRMcFaddin, EAMcKenney, MLMcNulty, OTMetcalf, ATMoreno, DARamann, GATang, TPRen, LWalls, SM Substituted pyrazolo[1,5-A]pyridine compounds as RET kinase inhibitors US Patent  US10441581 Publication Date 10/15/2019 
Target
Name:
Proto-oncogene tyrosine-protein kinase receptor Ret [658-1114,V804M]
Synonyms:
CDHF12 PTC Proto-oncogene tyrosine-protein kinase receptor Ret (V804M) RET Kinase (V804M) (aa658-end) RET_HUMAN
Type:
Enzyme Catalytic Domain
Mol. Mass.:
51567.23
Organism:
Homo sapiens (Human)
Description:
P07949[658-1114,V804M]
Residue:
457
  
Inhibitor
Name:
BDBM305398
Synonyms:
US10144734, Example 415 US10441581, Example 415 US11648243, Example 415
Type:
Small organic molecule
Emp. Form.:
C26H27N7O3
Mol. Mass.:
485.5377
SMILES:
C[C@@H](O)COc1cc(-c2ccc(nc2)N2CCC(CC2)Oc2ccc(C)nn2)c2c(cnn2c1)C#N
: