Target
Proto-oncogene tyrosine-protein kinase receptor Ret [658-1114,V804M]
Ligand
BDBM305468
Substrate
Meas. Tech.
RET Enzyme Assay
IC50
3.70±n/a nM
Citation
 Andrews, SWAronow, SBlake, JFBrandhuber, BJCollier, JCook, AHaas, JJiang, YKolakowski, GRMcFaddin, EAMcKenney, MLMcNulty, OTMetcalf, ATMoreno, DARamann, GATang, TPRen, LWalls, SM Substituted pyrazolo[1,5-A]pyridine compounds as RET kinase inhibitors US Patent  US10441581 Publication Date 10/15/2019 
Target
Name:
Proto-oncogene tyrosine-protein kinase receptor Ret [658-1114,V804M]
Synonyms:
CDHF12 PTC Proto-oncogene tyrosine-protein kinase receptor Ret (V804M) RET Kinase (V804M) (aa658-end) RET_HUMAN
Type:
Enzyme Catalytic Domain
Mol. Mass.:
51567.23
Organism:
Homo sapiens (Human)
Description:
P07949[658-1114,V804M]
Residue:
457
  
Inhibitor
Name:
BDBM305468
Synonyms:
US10144734, Example 485 US10441581, Example 485 US11648243, Example 485
Type:
Small organic molecule
Emp. Form.:
C27H25FN6O2
Mol. Mass.:
484.5248
SMILES:
Cc1ccc(F)cc1C(=O)NC1(C)CCN(CC1)c1ccc(cn1)-c1cc(O)cn2ncc(C#N)c12
: