Target
Proto-oncogene tyrosine-protein kinase receptor Ret [658-1114,V804M]
Ligand
BDBM305712
Substrate
Meas. Tech.
RET Enzyme Assay
IC50
5.00±n/a nM
Citation
 Andrews, SWAronow, SBlake, JFBrandhuber, BJCollier, JCook, AHaas, JJiang, YKolakowski, GRMcFaddin, EAMcKenney, MLMcNulty, OTMetcalf, ATMoreno, DARamann, GATang, TPRen, LWalls, SM Substituted pyrazolo[1,5-A]pyridine compounds as RET kinase inhibitors US Patent  US10441581 Publication Date 10/15/2019 
Target
Name:
Proto-oncogene tyrosine-protein kinase receptor Ret [658-1114,V804M]
Synonyms:
CDHF12 PTC Proto-oncogene tyrosine-protein kinase receptor Ret (V804M) RET Kinase (V804M) (aa658-end) RET_HUMAN
Type:
Enzyme Catalytic Domain
Mol. Mass.:
51567.23
Organism:
Homo sapiens (Human)
Description:
P07949[658-1114,V804M]
Residue:
457
  
Inhibitor
Name:
BDBM305712
Synonyms:
N-((3S,4S)-3-amino-1-(5- (3-cyano-6- ethoxypyrazolo[1,5- a]pyridin-4-yl)pyridin-2- yl)piperidin-4-yl)-2- chloro-6-methylbenzamide US10172845, Example 730 US10881652, Example 730 | US11648243, Example 730
Type:
Small organic molecule
Emp. Form.:
C28H28ClN7O2
Mol. Mass.:
530.021
SMILES:
CCOc1cc(-c2ccc(nc2)N2CC[C@H](NC(=O)c3c(C)cccc3Cl)[C@@H](N)C2)c2c(cnn2c1)C#N
: