Target
Proto-oncogene tyrosine-protein kinase receptor Ret [658-1114,V804M]
Ligand
BDBM305736
Substrate
Meas. Tech.
RET Enzyme Assay
IC50
7.00±n/a nM
Citation
 Andrews, SWAronow, SBlake, JFBrandhuber, BJCollier, JCook, AHaas, JJiang, YKolakowski, GRMcFaddin, EAMcKenney, MLMcNulty, OTMetcalf, ATMoreno, DARamann, GATang, TPRen, LWalls, SM Substituted pyrazolo[1,5-A]pyridine compounds as RET kinase inhibitors US Patent  US10441581 Publication Date 10/15/2019 
Target
Name:
Proto-oncogene tyrosine-protein kinase receptor Ret [658-1114,V804M]
Synonyms:
CDHF12 PTC Proto-oncogene tyrosine-protein kinase receptor Ret (V804M) RET Kinase (V804M) (aa658-end) RET_HUMAN
Type:
Enzyme Catalytic Domain
Mol. Mass.:
51567.23
Organism:
Homo sapiens (Human)
Description:
P07949[658-1114,V804M]
Residue:
457
  
Inhibitor
Name:
BDBM305736
Synonyms:
4-(6-(4-((5-fluoropyridin- 3-yl)methyl)-4- hydroxypiperidin-1- yl)pyridin-3-yl)-6-(2- hydroxy-2- methylpropoxy) pyrazolo[1,5-a] pyridine-3-carbonitrile US10172845, Example 754 US10881652, Example 754 | US11648243, Example 754
Type:
Small organic molecule
Emp. Form.:
C28H29FN6O3
Mol. Mass.:
516.5667
SMILES:
CC(C)(O)COc1cc(-c2ccc(nc2)N2CCC(O)(Cc3cncc(F)c3)CC2)c2c(cnn2c1)C#N
: