Target
Proto-oncogene tyrosine-protein kinase receptor Ret [658-1114,V804M]
Ligand
BDBM305776
Substrate
Meas. Tech.
RET Enzyme Assay
IC50
5.00±n/a nM
Citation
 Andrews, SWAronow, SBlake, JFBrandhuber, BJCollier, JCook, AHaas, JJiang, YKolakowski, GRMcFaddin, EAMcKenney, MLMcNulty, OTMetcalf, ATMoreno, DARamann, GATang, TPRen, LWalls, SM Substituted pyrazolo[1,5-A]pyridine compounds as RET kinase inhibitors US Patent  US10441581 Publication Date 10/15/2019 
Target
Name:
Proto-oncogene tyrosine-protein kinase receptor Ret [658-1114,V804M]
Synonyms:
CDHF12 PTC Proto-oncogene tyrosine-protein kinase receptor Ret (V804M) RET Kinase (V804M) (aa658-end) RET_HUMAN
Type:
Enzyme Catalytic Domain
Mol. Mass.:
51567.23
Organism:
Homo sapiens (Human)
Description:
P07949[658-1114,V804M]
Residue:
457
  
Inhibitor
Name:
BDBM305776
Synonyms:
2-chloro-N-(1-(5-(3- cyano-6- methoxypyrazolo[1,5- a]pyridin-4-yl)pyrazin-2- yl)-4-methylpiperidin-4- yl)-5-fluorobenzamide US10172845, Example 794 US10881652, Example 794 | US11648243, Example 794
Type:
Small organic molecule
Emp. Form.:
C26H23ClFN7O2
Mol. Mass.:
519.958
SMILES:
COc1cc(-c2cnc(cn2)N2CCC(C)(CC2)NC(=O)c2cc(F)ccc2Cl)c2c(cnn2c1)C#N
: