Target
Proto-oncogene tyrosine-protein kinase receptor Ret [658-1114,V804M]
Ligand
BDBM305778
Substrate
Meas. Tech.
RET Enzyme Assay
IC50
5.00±n/a nM
Citation
 Andrews, SWAronow, SBlake, JFBrandhuber, BJCollier, JCook, AHaas, JJiang, YKolakowski, GRMcFaddin, EAMcKenney, MLMcNulty, OTMetcalf, ATMoreno, DARamann, GATang, TPRen, LWalls, SM Substituted pyrazolo[1,5-A]pyridine compounds as RET kinase inhibitors US Patent  US10441581 Publication Date 10/15/2019 
Target
Name:
Proto-oncogene tyrosine-protein kinase receptor Ret [658-1114,V804M]
Synonyms:
CDHF12 PTC Proto-oncogene tyrosine-protein kinase receptor Ret (V804M) RET Kinase (V804M) (aa658-end) RET_HUMAN
Type:
Enzyme Catalytic Domain
Mol. Mass.:
51567.23
Organism:
Homo sapiens (Human)
Description:
P07949[658-1114,V804M]
Residue:
457
  
Inhibitor
Name:
BDBM305778
Synonyms:
3-chloro-N-(1-(5-(3- cyano-6- methoxypyrazolo[1,5- a]pyridin-4-yl)pyrazin-2- yl)-4-methylpiperidin-4- yl)-6-methylpicolinamide US10172845, Example 796 US10881652, Example 796 | US11648243, Example 796
Type:
Small organic molecule
Emp. Form.:
C26H25ClN8O2
Mol. Mass.:
516.982
SMILES:
COc1cc(-c2cnc(cn2)N2CCC(C)(CC2)NC(=O)c2nc(C)ccc2Cl)c2c(cnn2c1)C#N
: