Target
Proto-oncogene tyrosine-protein kinase receptor Ret [658-1114,V804M]
Ligand
BDBM305790
Substrate
Meas. Tech.
RET Enzyme Assay
IC50
6.00±n/a nM
Citation
 Andrews, SWAronow, SBlake, JFBrandhuber, BJCollier, JCook, AHaas, JJiang, YKolakowski, GRMcFaddin, EAMcKenney, MLMcNulty, OTMetcalf, ATMoreno, DARamann, GATang, TPRen, LWalls, SM Substituted pyrazolo[1,5-A]pyridine compounds as RET kinase inhibitors US Patent  US10441581 Publication Date 10/15/2019 
Target
Name:
Proto-oncogene tyrosine-protein kinase receptor Ret [658-1114,V804M]
Synonyms:
CDHF12 PTC Proto-oncogene tyrosine-protein kinase receptor Ret (V804M) RET Kinase (V804M) (aa658-end) RET_HUMAN
Type:
Enzyme Catalytic Domain
Mol. Mass.:
51567.23
Organism:
Homo sapiens (Human)
Description:
P07949[658-1114,V804M]
Residue:
457
  
Inhibitor
Name:
BDBM305790
Synonyms:
(S)-N-(4-benzyl-1-(5-(3- cyano-6- ethoxypyrazolo[1,5- a]pyridin-4-yl)pyridin-2- yl)piperidin-4-yl)-3- hydroxybutanamide US10172845, Example 808 US10881652, Example 808 | US11648243, Example 808
Type:
Small organic molecule
Emp. Form.:
C31H34N6O3
Mol. Mass.:
538.6401
SMILES:
CCOc1cc(-c2ccc(nc2)N2CCC(Cc3ccccc3)(CC2)NC(=O)C[C@H](C)O)c2c(cnn2c1)C#N
: