Target
Isocitrate dehydrogenase [NADP] cytoplasmic [R132H]
Ligand
BDBM247705
Substrate
Meas. Tech.
Fluorescence Biochemical Assay
pH
7.5±n/a
Temperature
298.15±n/a K
IC50
29.0±n/a nM
Comments
extracted
Citation
 Caferro, TRChen, ZCho, YSCostales, AQLevell, JRLiu, GManning, JRSendzik, MShafer, CShultz, MDSutton, JCWang, YZhao, Q 3-pyrimidin-4-yl-oxazolidin-2-ones as inhibitors of mutant IDH US Patent  US10112931 Publication Date 10/30/2018 
Target
Name:
Isocitrate dehydrogenase [NADP] cytoplasmic [R132H]
Synonyms:
Cytosolic NADP-isocitrate dehydrogenase (IDH1)(R132H) IDH1 R132H IDHC_HUMAN Isocitrate dehydrogenase 1 mutant (R132H) Isocitrate dehydrogenase [NADP] cytoplasmic (IDH1)(R132H) PICD
Type:
Protein
Mol. Mass.:
46641.74
Organism:
Homo sapiens (Human)
Description:
Human IDH1 R132H (SEQ ID No. 2 in patent). First three are removed. Google patent parsed wrong.
Residue:
414
  
Inhibitor
Name:
BDBM247705
Synonyms:
US10112931, Example 307 US9688672, Example 307
Type:
Small organic molecule
Emp. Form.:
C20H21ClN6O3
Mol. Mass.:
428.872
SMILES:
C[C@@H](O)[C@H]1COC(=O)N1c1ccnc(N[C@@H](C)c2cn(cn2)-c2ccc(Cl)cc2)n1
: