Target
Cannabinoid receptor 1
Ligand
BDBM419185
Substrate
Ki
2963±n/a nM
Citation
 Gobbi, LGrether, UGuba, WKretz, JMartin, REWestphal, MV [1,2,3]triazolo[4,5-d]pyrimidine derivatives US Patent  US10457684 Publication Date 10/29/2019 
Target
Name:
Cannabinoid receptor 1
Synonyms:
CANN6 CB-R CNR CNR1_HUMAN Cannabinoid receptor Cannabinoid receptor 1 (brain)
Type:
G Protein-Coupled Receptor (GPCR)
Mol. Mass.:
52868.96
Organism:
Homo sapiens (Human)
Description:
P21554
Residue:
472
  
Inhibitor
Name:
BDBM419185
Synonyms:
5-tert-Butyl-3-[(4-methyl-1,2,5-oxadiazol-3-yl)methyl]-7-(1,2,5-triazaspiro[2.4]hept-1-en-5-yl)-3H-[1,2,3]triazolo[4,5-d]pyrimidine | US10457684, Example 1
Type:
Small organic molecule
Emp. Form.:
C16H20N10O
Mol. Mass.:
368.3964
SMILES:
Cc1nonc1Cn1nnc2c(nc(nc12)C(C)(C)C)N1CCC2(C1)N=N2
: