Target
Cannabinoid receptor 2
Ligand
BDBM419190
Substrate
Meas. Tech.
Radioligand Binding Assay
Ki
3.30±n/a nM
Citation
 Gobbi, LGrether, UGuba, WKretz, JMartin, REWestphal, MV [1,2,3]triazolo[4,5-d]pyrimidine derivatives US Patent  US10457684 Publication Date 10/29/2019 
Target
Name:
Cannabinoid receptor 2
Synonyms:
CANNABINOID CB2 CB2 CB2B CNR2_HUMAN Cannabinoid CB2 receptor Cannabinoid receptor 2 (CB2R) | hCB2
Type:
G Protein-Coupled Receptor (GPCR)
Mol. Mass.:
39690.94
Organism:
Homo sapiens (Human)
Description:
P34972
Residue:
360
  
Inhibitor
Name:
BDBM419190
Synonyms:
5-tert-Butyl-3-[(2-chlorophenyl)methyl]-7-(1,2,5-triazaspiro[2.4]hept-1-en-5-yl)-3H-[1,2,3]triazolo[4,5-d]pyrimidine | US10457684, Example 3
Type:
Small organic molecule
Emp. Form.:
C19H21ClN8
Mol. Mass.:
396.877
SMILES:
CC(C)(C)c1nc(N2CCC3(C2)N=N3)c2nnn(Cc3ccccc3Cl)c2n1
: