Target
Cannabinoid receptor 1
Ligand
BDBM419190
Substrate
Ki
321±n/a nM
Citation
 Gobbi, LGrether, UGuba, WKretz, JMartin, REWestphal, MV [1,2,3]triazolo[4,5-d]pyrimidine derivatives US Patent  US10457684 Publication Date 10/29/2019 
Target
Name:
Cannabinoid receptor 1
Synonyms:
CANN6 CB-R CNR CNR1_HUMAN Cannabinoid receptor Cannabinoid receptor 1 (brain)
Type:
G Protein-Coupled Receptor (GPCR)
Mol. Mass.:
52868.96
Organism:
Homo sapiens (Human)
Description:
P21554
Residue:
472
  
Inhibitor
Name:
BDBM419190
Synonyms:
5-tert-Butyl-3-[(2-chlorophenyl)methyl]-7-(1,2,5-triazaspiro[2.4]hept-1-en-5-yl)-3H-[1,2,3]triazolo[4,5-d]pyrimidine | US10457684, Example 3
Type:
Small organic molecule
Emp. Form.:
C19H21ClN8
Mol. Mass.:
396.877
SMILES:
CC(C)(C)c1nc(N2CCC3(C2)N=N3)c2nnn(Cc3ccccc3Cl)c2n1
: