Target
Cannabinoid receptor 2
Ligand
BDBM419268
Substrate
Meas. Tech.
Radioligand Binding Assay
Ki
31.0±n/a nM
Citation
 Gobbi, LGrether, UGuba, WKretz, JMartin, REWestphal, MV [1,2,3]triazolo[4,5-d]pyrimidine derivatives US Patent  US10457684 Publication Date 10/29/2019 
Target
Name:
Cannabinoid receptor 2
Synonyms:
CANNABINOID CB2 CB2 CB2B CNR2_HUMAN Cannabinoid CB2 receptor Cannabinoid receptor 2 (CB2R) | hCB2
Type:
G Protein-Coupled Receptor (GPCR)
Mol. Mass.:
39690.94
Organism:
Homo sapiens (Human)
Description:
P34972
Residue:
360
  
Inhibitor
Name:
BDBM419268
Synonyms:
5-[Difluoro(phenyl)methyl]-7-(3,3-difluoropyrrolidin-1-yl)-3-[[2-ethynyl-6-[3-(trifluoromethyl)diazirin-3-yl]phenyl]methyl]triazolo[4,5-d]pyrimidine | US10457684, Example 12
Type:
Small organic molecule
Emp. Form.:
C26H17F7N8
Mol. Mass.:
574.4556
SMILES:
FC(F)(F)C1(N=N1)c1cccc(C#C)c1Cn1nnc2c(nc(nc12)C(F)(F)c1ccccc1)N1CCC(F)(F)C1
: