Target
Lysine-specific demethylase 4C
Ligand
BDBM296085
Substrate
Meas. Tech.
JMJD2C Assay
Temperature
298.15±n/a K
IC50
550±n/a nM
Comments
extracted
Citation
 Boloor, AKanouni, TStafford, JAVeal, JMWallace, MB Histone demethylase inhibitors US Patent  US10112940 Publication Date 10/30/2018 
Target
Name:
Lysine-specific demethylase 4C
Synonyms:
GASC-1 protein Gene amplified in squamous cell carcinoma 1 protein JMJD2C Jumonji domain-containing protein 2C KDM4C_HUMAN | KIAA0780
Type:
Protein
Mol. Mass.:
119979.01
Organism:
Homo sapiens (Human)
Description:
Q9H3R0
Residue:
1056
  
Inhibitor
Name:
BDBM296085
Synonyms:
2-{4-[methyl(2- phenylethyl)amino]phenoxy}pyridino[3,4- d]pyrimidin-4-ol US10202381, Example 13 US10611763, Example 13 US11535616, Example 13
Type:
Small organic molecule
Emp. Form.:
C22H20N4O2
Mol. Mass.:
372.4198
SMILES:
CN(CCc1ccccc1)c1ccc(Oc2nc(O)c3ccncc3n2)cc1
: