Target
Proto-oncogene tyrosine-protein kinase receptor Ret [V804M]
Ligand
BDBM296543
Substrate
IC50
80.8±n/a nM
Citation
 Andrews, SWAronow, SBlake, JFBrandhuber, BJCook, AHaas, JJiang, YKolakowski, GRMcFaddin, EAMcKenney, MLMcNulty, OTMetcalf, ATMoreno, DATang, TPRen, L Substituted pyrazolo[1,5-A]pyridine compounds as RET kinase inhibitors US Patent  US10112942 Publication Date 10/30/2018 
Target
Name:
Proto-oncogene tyrosine-protein kinase receptor Ret [V804M]
Synonyms:
CDHF12 PTC RET RET51 ret enzyme (v804m)
Type:
Enzyme Catalytic Domain
Mol. Mass.:
124350.36
Organism:
Homo sapiens (Human)
Description:
P07949[V804M]
Residue:
1114
  
Inhibitor
Name:
BDBM296543
Synonyms:
US10112942, Example 277 US10172851, Example 277 US10953005, Example 277
Type:
Small organic molecule
Emp. Form.:
C29H30FN7O3
Mol. Mass.:
543.592
SMILES:
CC(C)(O)COc1cc(-c2ccc(nc2)N2CCN(CC2)C(=O)C(N)c2ccc(F)cc2)c2c(cnn2c1)C#N
: