Target
Metallo-beta-lactamase type 2
Ligand
BDBM360961
Substrate
Meas. Tech.
Enzyme Activity: Determination of IC50
IC50
0.243±n/a nM
Citation
 Bennett, FJiang, JPasternak, ADong, SGu, XScott, JDTang, HZhao, ZHuang, YYang, DYoung, KXiao, LZhang, ZFu, J Metallo-beta-lactamase inhibitors US Patent  US10544130 Publication Date 1/28/2020 
Target
Name:
Metallo-beta-lactamase type 2
Synonyms:
B2 metallo-beta-lactamase BLAB_SERMA IMP-1 | Metallo-beta-lactamase type II
Type:
undefined
Mol. Mass.:
27125.88
Organism:
Serratia marcescens
Description:
P52699
Residue:
246
  
Inhibitor
Name:
BDBM360961
Synonyms:
2-(4-(2- aminobenzo[d] thiazol-4-yl)-2- sulfamoyl-3-(1H- tetrazol-5-yl)phenyl- sulfonamido)-2- methylpropan-1- aminium formate US10544130, Example 117
Type:
Small organic molecule
Emp. Form.:
C18H21N9O4S3
Mol. Mass.:
523.612
SMILES:
CC(C)(CN)NS(=O)(=O)c1ccc(-c2cccc3sc(N)nc23)c(-c2nnn[nH]2)c1S(N)(=O)=O
: