Target
Proto-oncogene tyrosine-protein kinase receptor Ret [658-1114]
Ligand
BDBM296543
Substrate
Meas. Tech.
Enzyme Assay
IC50
9.70±n/a nM
Citation
 Andrews, SWAronow, SBlake, JFBrandhuber, BJCook, AHaas, JJiang, YKolakowski, GRMcFaddin, EAMcKenney, MLMcNulty, OTMetcalf, ATMoreno, DATang, TPRen, L Substituted pyrazolo[1,5-A]pyridine compounds as RET kinase inhibitors US Patent  US10555944 Publication Date 2/11/2020 
Target
Name:
Proto-oncogene tyrosine-protein kinase receptor Ret [658-1114]
Synonyms:
CDHF12 PTC Proto-oncogene tyrosine-protein kinase receptor Ret (aa 658-1114) RET Kinase (aa 658-1114) RET_HUMAN
Type:
Mol. Mass.:
51535.16
Organism:
Homo sapiens (Human)
Description:
P07949[658-1114]
Residue:
457
  
Inhibitor
Name:
BDBM296543
Synonyms:
US10112942, Example 277 US10172851, Example 277 US10953005, Example 277
Type:
Small organic molecule
Emp. Form.:
C29H30FN7O3
Mol. Mass.:
543.592
SMILES:
CC(C)(O)COc1cc(-c2ccc(nc2)N2CCN(CC2)C(=O)C(N)c2ccc(F)cc2)c2c(cnn2c1)C#N
: