Target
Metabotropic glutamate receptor 5
Ligand
BDBM393789
Substrate
Meas. Tech.
In Vitro GIRK Thallium Flux (60 minute) Assay
EC50
1950±n/a nM
Citation
 Cosford, NDRaveendra-Panickar, DSheffler, DJHutchinson, JHGadient, RA Metabotropic glutamate receptor negative allosteric modulators (NAMs) and uses thereof US Patent  US10597367 Publication Date 3/24/2020 
Target
Name:
Metabotropic glutamate receptor 5
Synonyms:
GRM5_RAT Grm5 Mglur5 metabotropic glutamate 5/1-C metabotropic glutamate 5a
Type:
Enzyme
Mol. Mass.:
131900.14
Organism:
Rattus norvegicus (Rat)
Description:
P31424
Residue:
1203
  
Inhibitor
Name:
BDBM393789
Synonyms:
US10597367, Example 78 | US9969726, Example 78
Type:
Small organic molecule
Emp. Form.:
C24H12ClF6N3O2
Mol. Mass.:
523.814
SMILES:
OC(=O)c1ccc(c(Cl)c1)-c1cccc(c1)-c1nc(cc(n1)C(F)(F)F)-c1ccc(nc1)C(F)(F)F
: