Target
Mitogen-activated protein kinase kinase kinase 5
Ligand
BDBM445490
Substrate
Meas. Tech.
HTRF KinEASE Assay
IC50
5.5±n/a nM
Citation
 Granger, BWang, GShen, RHe, JOr, YS Apoptosis signal-regulating kinase 1 inhibitors and methods of use thereof US Patent  US10683289 Publication Date 6/16/2020 
Target
Name:
Mitogen-activated protein kinase kinase kinase 5
Synonyms:
ASK1 MAP3K5 MEKK5
Type:
Protein
Mol. Mass.:
154514.93
Organism:
Homo sapiens (Human)
Description:
Q99683
Residue:
1374
  
Inhibitor
Name:
BDBM445490
Synonyms:
US10683289, Example 11
Type:
Small organic molecule
Emp. Form.:
C22H27N7O5S
Mol. Mass.:
501.559
SMILES:
CCOc1cc2CN(C(C)C)S(=O)(=O)c2cc1C(=O)Nc1cccc(n1)-c1nnnn1[C@H](C)CO
: