Target
Cathepsin S
Ligand
BDBM447458
Substrate
Meas. Tech.
Enzyme Inhibition Assay
IC50
223±n/a nM
Citation
 Haap, WKuhn, BLuebbers, TPeters, J Pyrrolidine derivatives US Patent  US10689339 Publication Date 6/23/2020 
Target
Name:
Cathepsin S
Synonyms:
CATS_HUMAN Cathepsin S (Cat S) | cathepsin S preproprotein
Type:
Protein
Mol. Mass.:
37507.38
Organism:
Homo sapiens (Human)
Description:
P25774
Residue:
331
  
Inhibitor
Name:
BDBM447458
Synonyms:
(2S,4R)-4-(4-(3-chloro-1H-1,2,4-triazol-1-yl)-2-methylphenylsulfonyl)-N-(1-cyanocyclopropyl)-1-(1-(trifluoromethyl)cyclopropanecarbonyl)pyrrolidine-2-carboxamide | US10689339, Example 66
Type:
Small organic molecule
Emp. Form.:
C23H22ClF3N6O4S
Mol. Mass.:
570.972
SMILES:
Cc1cc(ccc1S(=O)(=O)[C@@H]1C[C@H](N(C1)C(=O)C1(CC1)C(F)(F)F)C(=O)NC1(CC1)C#N)-n1cnc(Cl)n1
: