Target
Plasma kallikrein
Ligand
BDBM448387
Substrate
Meas. Tech.
Inhibition Assay
Ki
0.100±n/a nM
Citation
 Eckhardt, MGollner, ALangkopf, EWagner, HWiedenmayer, D Heteroaromatic carboxamide derivatives as plasma kallikrein inhibitors US Patent  US10695334 Publication Date 6/30/2020 
Target
Name:
Plasma kallikrein
Synonyms:
Fletcher factor KLKB1 Kallikrein Plasma kallikrein heavy chain Plasma prekallikrein
Type:
Protein
Mol. Mass.:
71391.16
Organism:
Homo sapiens (Human)
Description:
P03952
Residue:
638
  
Inhibitor
Name:
BDBM448387
Synonyms:
1-[(6-{3-Azabicyclo[3.1.0]hexan-3-yl}-2-methyl- | US10695334, Example 16
Type:
Small organic molecule
Emp. Form.:
C25H31N7O2
Mol. Mass.:
461.5593
SMILES:
COCc1nn(Cc2ccc(nc2C)N2CC3CC3C2)cc1C(=O)N[C@@H]1CCc2c(C)n[nH]c12
: