Target
Nuclear receptor ROR-gamma
Ligand
BDBM352908
Substrate
Meas. Tech.
Biological Assay
IC50
3.46±n/a nM
Citation
 Aicher, TDVanHuis, CAThomas, WDMacLean, JKAndresen, BMBarr, KJBienstock, CEAnthony, NJDaniels, MLiu, KLiu, YWhite, CMLapointe, BTSciammetta, NSimov, V Tetrahydronaphthyridine, benzoxazine, aza-benzoxazine and related bicyclic compounds for inhibition of RORgamma activity and the treatment of disease US Patent  US10745364 Publication Date 8/18/2020 
Target
Name:
Nuclear receptor ROR-gamma
Synonyms:
NR1F3 Nuclear receptor ROR-gamma (RORC) RAR-related orphan receptor C (RORc) RORG RZRG Retinoid-related orphan receptor-gamma (RORc)
Type:
Enzyme Catalytic Domain
Mol. Mass.:
58218.40
Organism:
Homo sapiens (Human)
Description:
P51449
Residue:
518
  
Inhibitor
Name:
BDBM352908
Synonyms:
2,2,2-trifluoro-1,1- dimethylethyl (1-{[2- (trifluoromethyl)pyridin-4- yl]sulfonyl}-1,2,3,4- tetrahydroquinolin-7- yl)carbamate US9809561, 114D
Type:
Small organic molecule
Emp. Form.:
C20H19F6N3O4S
Mol. Mass.:
511.438
SMILES:
CC(C)(OC(=O)Nc1ccc2CCCN(c2c1)S(=O)(=O)c1ccnc(c1)C(F)(F)F)C(F)(F)F
: