Target
Histone deacetylase 2
Ligand
BDBM411380
Substrate
IC50
<10±n/a nM
Citation
 van Duzer, JHMazitschek, R Substituted piperazines as selective HDAC1,2 inhibitors US Patent  US10774056 Publication Date 9/15/2020 
Target
Name:
Histone deacetylase 2
Synonyms:
Cereblon/Histone deacetylase 2 HDAC2 Histone deacetylase 2 (HDAC2) | Human HDAC2
Type:
Chromatin regulator; hydrolase; repressor
Mol. Mass.:
55356.54
Organism:
Homo sapiens (Human)
Description:
Q92769
Residue:
488
  
Inhibitor
Name:
BDBM411380
Synonyms:
US10385031, Compound 086 US11542242, Compound 086
Type:
Small organic molecule
Emp. Form.:
C20H22N6OS
Mol. Mass.:
394.493
SMILES:
CN1CCN(CC1)c1cnc(cn1)C(=O)Nc1cc(ccc1N)-c1cccs1
: