Target
Cyclin-dependent kinase 4/G1/S-specific cyclin-D1
Ligand
BDBM7601
Substrate
GST-Rb fusion protein
Meas. Tech.
CDK Assay
pH
7±n/a
Temperature
295.15±n/a K
IC50
500±n/a nM
Citation
 Beattie, JFBreault, GAEllston, RPGreen, SJewsbury, PJMidgley, CJNaven, RTMinshull, CAPauptit, RATucker, JAPease, JE Cyclin-dependent kinase 4 inhibitors as a treatment for cancer. Part 1: identification and optimisation of substituted 4,6-bis anilino pyrimidines. Bioorg Med Chem Lett 13:2955-60 (2003)  
Target
Name:
Cyclin-dependent kinase 4/G1/S-specific cyclin-D1
Synonyms:
CDK4/CycD CDK4/Cyclin D1 Cyclin-Dependent Kinase 4 (CDK4) Cyclin-dependent kinase 4/G1/S-specific cyclin D1 | Cyclin-dependent kinase 4/cyclin D1
Type:
Protein Complex
Mol. Mass.:
Description:
CDK4/D1 complexes were purified from insect cells co-infected with baculovirus vectors containing each of the components.
Components:
This complex has 2 components.
Component 1
Name:
Cyclin-dependent kinase 4
Synonyms:
CDK4 Cell division protein kinase 4 PSK-J3
Type:
Enzyme Subunit
Mol. Mass.:
33731.96
Organism:
Homo sapiens (Human)
Description:
P11802
Residue:
303
  
Component 2
Name:
G1/S-specific cyclin-D1
Synonyms:
B-cell lymphoma 1 protein BCL-1 oncogene CCND1 PRAD1 | PRAD1 oncogene
Type:
Enzyme Subunit
Mol. Mass.:
33717.70
Organism:
Homo sapiens (Human)
Description:
Residue:
295
  
Inhibitor
Name:
BDBM7601
Synonyms:
3-[(2,5-dichlorophenyl)[6-({4-[3-(dimethylamino)-2-hydroxypropoxy]phenyl}amino)pyrimidin-4-yl]amino]propanenitrile | 4,6-bis anilino pyrimidine deriv. 14
Type:
Small organic molecule
Emp. Form.:
C24H26Cl2N6O2
Mol. Mass.:
501.408
SMILES:
CN(C)CC(O)COc1ccc(Nc2cc(ncn2)N(CCC#N)c2cc(Cl)ccc2Cl)cc1
:
Substrate
Name:
GST-Rb fusion protein
Synonyms:
Glutathione S-transferase (GST)-retinoblastoma (Rb) fusion RB1 Rb | retinoblastoma
Type:
Other Protein Type
Mol. Mass.:
106410.17
Organism:
Homo sapiens (Human)
Description:
GST-60 kDa Rb fusion protein (comprising amino acids 378 to 928 of retinoblastoma)
Residue:
928