Target
Cyclin-dependent kinase 2/G1/S-specific cyclin-E1
Ligand
BDBM7594
Substrate
GST-Rb fusion protein
Meas. Tech.
CDK Assay
IC50
28000±n/a nM
Citation
 Beattie, JFBreault, GAEllston, RPGreen, SJewsbury, PJMidgley, CJNaven, RTMinshull, CAPauptit, RATucker, JAPease, JE Cyclin-dependent kinase 4 inhibitors as a treatment for cancer. Part 1: identification and optimisation of substituted 4,6-bis anilino pyrimidines. Bioorg Med Chem Lett 13:2955-60 (2003)  
Target
Name:
Cyclin-dependent kinase 2/G1/S-specific cyclin-E1
Synonyms:
CDK2/CycE CDK2/E Cyclin-Dependent Kinase 2 (CDK2) Cyclin-dependent kinase 2/cyclin E1
Type:
Protein
Mol. Mass.:
Description:
Components:
This complex has 2 components.
Component 1
Name:
Cyclin-dependent kinase 2
Synonyms:
CDK2 CDK2_HUMAN Cell division protein kinase 2 Protein cereblon/Cyclin-dependent kinase 2 | p33 protein kinase
Type:
Enzyme Subunit
Mol. Mass.:
33938.17
Organism:
Homo sapiens (Human)
Description:
P24941
Residue:
298
  
Component 2
Name:
G1/S-specific cyclin-E1
Synonyms:
CCNE CCNE1_HUMAN
Type:
Enzyme Subunit
Mol. Mass.:
47073.17
Organism:
Homo sapiens (Human)
Description:
Residue:
410
  
Inhibitor
Name:
BDBM7594
Synonyms:
4,6-bis anilino pyrimidine deriv. 7 | 4-N-(2-bromophenyl)-6-N-{4-[3-(dimethylamino)-2-hydroxypropoxy]phenyl}pyrimidine-4,6-diamine
Type:
Small organic molecule
Emp. Form.:
C21H24BrN5O2
Mol. Mass.:
458.352
SMILES:
CN(C)CC(O)COc1ccc(Nc2cc(Nc3ccccc3Br)ncn2)cc1
:
Substrate
Name:
GST-Rb fusion protein
Synonyms:
Glutathione S-transferase (GST)-retinoblastoma (Rb) fusion RB1 Rb | retinoblastoma
Type:
Other Protein Type
Mol. Mass.:
106410.17
Organism:
Homo sapiens (Human)
Description:
GST-60 kDa Rb fusion protein (comprising amino acids 378 to 928 of retinoblastoma)
Residue:
928