Target
Endothelin-1
Ligand
BDBM168469
Substrate
Meas. Tech.
ET-1 Assay
EC50
125000±n/a nM
Citation
 PubChem, PCBuckman, BONicholas, JBRamphal, JYEmayan, KSeiwert, SD Anti-fibrotic pyridinones US Patent  US9675593 Publication Date 6/13/2017 
Target
Name:
Endothelin-1
Synonyms:
EDN1 PPET1 | Preproendothelin-1
Type:
Protein
Mol. Mass.:
24444.51
Organism:
Homo sapiens (Human)
Description:
P05305
Residue:
212
  
Inhibitor
Name:
BDBM168469
Synonyms:
US9675593, 29
Type:
Small organic molecule
Emp. Form.:
C16H17NO
Mol. Mass.:
239.3123
SMILES:
Cc1cn(-c2ccccc2)c(=O)c2CCCCc12
: