Target
Endothelin-1
Ligand
BDBM168478
Substrate
Meas. Tech.
ET-1 Assay
EC50
>200000±n/a nM
Citation
 PubChem, PCBuckman, BONicholas, JBRamphal, JYEmayan, KSeiwert, SD Anti-fibrotic pyridinones US Patent  US9675593 Publication Date 6/13/2017 
Target
Name:
Endothelin-1
Synonyms:
EDN1 PPET1 | Preproendothelin-1
Type:
Protein
Mol. Mass.:
24444.51
Organism:
Homo sapiens (Human)
Description:
P05305
Residue:
212
  
Inhibitor
Name:
BDBM168478
Synonyms:
US9675593, 38
Type:
Small organic molecule
Emp. Form.:
C22H11F7N2O2
Mol. Mass.:
468.3238
SMILES:
Fc1ccc(cc1)-c1cn(-c2ccc(OC(F)(F)F)cc2)c(=O)c2ccc(nc12)C(F)(F)F
: