Target
Endothelin-1
Ligand
BDBM168520
Substrate
Meas. Tech.
ET-1 Assay
EC50
<50000±n/a nM
Citation
 PubChem, PCBuckman, BONicholas, JBRamphal, JYEmayan, KSeiwert, SD Anti-fibrotic pyridinones US Patent  US9675593 Publication Date 6/13/2017 
Target
Name:
Endothelin-1
Synonyms:
EDN1 PPET1 | Preproendothelin-1
Type:
Protein
Mol. Mass.:
24444.51
Organism:
Homo sapiens (Human)
Description:
P05305
Residue:
212
  
Inhibitor
Name:
BDBM168520
Synonyms:
US9675593, 79
Type:
Small organic molecule
Emp. Form.:
C18H14FNO
Mol. Mass.:
279.3083
SMILES:
Fc1ccc(cc1)-c1ccc(=O)n(Cc2ccccc2)c1
: