Target
Cyclin-A2/Cyclin-dependent kinase 2
Ligand
BDBM7772
Substrate
Peptide Substrate
Meas. Tech.
Kinase Inhibition SPA Assay
IC50
14±n/a nM
Citation
 Bramson, HNCorona, JDavis, STDickerson, SHEdelstein, MFrye, SVGampe, RTHarris, PAHassell, AHolmes, WDHunter, RNLackey, KELovejoy, BLuzzio, MJMontana, VRocque, WJRusnak, DShewchuk, LVeal, JMWalker, DHKuyper, LF Oxindole-based inhibitors of cyclin-dependent kinase 2 (CDK2): design, synthesis, enzymatic activities, and X-ray crystallographic analysis. J Med Chem 44:4339-58 (2001)  
Target
Name:
Cyclin-A2/Cyclin-dependent kinase 2
Synonyms:
CDK2-CyclinA CDK2/Cyclin A Cyclin A2/dependent kinase 2 Cyclin-Dependent Kinase 2 (CDK2A)
Type:
Protein Complex
Mol. Mass.:
Description:
Cdk2/Cyclin A kinase was purified from insect cells coinfected with Cyclin A/Cdk2 baculovirus.
Components:
This complex has 2 components.
Component 1
Name:
Cyclin-dependent kinase 2
Synonyms:
CDK2 CDK2_HUMAN Cell division protein kinase 2 Protein cereblon/Cyclin-dependent kinase 2 | p33 protein kinase
Type:
Enzyme Subunit
Mol. Mass.:
33938.17
Organism:
Homo sapiens (Human)
Description:
P24941
Residue:
298
  
Component 2
Name:
Cyclin-A2
Synonyms:
CCN1 CCNA1 CCNA2_HUMAN Cyclin-A
Type:
Enzyme Subunit
Mol. Mass.:
48550.19
Organism:
Homo sapiens (Human)
Description:
P20248
Residue:
432
  
Inhibitor
Name:
BDBM7772
Synonyms:
5-({[(12Z)-11-oxo-3-thia-5,10-diazatricyclo[7.3.0.0^{2,6}]dodeca-1,4,6,8-tetraen-12-ylidene]methyl}amino)-1,3-dihydro-2-benzothiophene-2,2-dione CS245 | Oxindole-Based Inhibitor 108
Type:
Small organic molecule
Emp. Form.:
C18H13N3O3S2
Mol. Mass.:
383.444
SMILES:
O=C1Nc2ccc3ncsc3c2C1C=Nc1ccc2CS(=O)(=O)Cc2c1
:
Substrate
Name:
Peptide Substrate
Synonyms:
Type:
Peptide
Mol. Mass.:
5198.94
Organism:
Description:
Residue:
46