Target
Tyrosine-protein kinase Fyn
Ligand
BDBM340085
Substrate
Meas. Tech.
Enzyme Activity Assay
EC50
>1000±n/a nM
Citation
 Barf, TAJans, CGde Man, APOubrie, AARaaijmakers, HCRewinkel, JBSterrenburg, JGWijkmans, JC 4-imidazopyridazin-1-yl-benzamides as Btk inhibitors US Patent  US10934296 Publication Date 3/2/2021 
Target
Name:
Tyrosine-protein kinase Fyn
Synonyms:
FYN Proto-oncogene Syn SLK Src-like kinase | p59-Fyn
Type:
Enzyme
Mol. Mass.:
60762.21
Organism:
Homo sapiens (Human)
Description:
P06241
Residue:
537
  
Inhibitor
Name:
BDBM340085
Synonyms:
US10239883, Example 24 US9758524, Example 24
Type:
Small organic molecule
Emp. Form.:
C25H23N7O3
Mol. Mass.:
469.4952
SMILES:
CC#CC(=O)N1CCCC[C@H]1c1nc(-c2ccc(cc2)C(=O)Nc2ccon2)c2c(N)nccn12
: