Target
Serine hydroxymethyltransferase, cytosolic
Ligand
BDBM285672
Substrate
Meas. Tech.
Enzymatic Assay
IC50
>5000±n/a nM
Citation
 Rabinowitz, JDKim, HDucker, GSGhergurovich, JM SHMT inhibitors US Patent  US10934305 Publication Date 3/2/2021 
Target
Name:
Serine hydroxymethyltransferase, cytosolic
Synonyms:
GLYC_HUMAN SHMT Serine methylase
Type:
PROTEIN
Mol. Mass.:
53091.10
Organism:
Homo sapiens (Human)
Description:
ChEMBL_745716
Residue:
483
  
Inhibitor
Name:
BDBM285672
Synonyms:
US10077273, Compound HK-2 | US10934305, Compound HK-2
Type:
Small organic molecule
Emp. Form.:
C19H20N4O2
Mol. Mass.:
336.3877
SMILES:
COc1cccc(c1)C1(C2CCC2)c2c(C)n[nH]c2OC(N)=C1C#N
: