Target
Proto-oncogene tyrosine-protein kinase receptor Ret [658-1114,V804M]
Ligand
BDBM296543
Substrate
Meas. Tech.
Enzyme Assay
IC50
80.8±n/a nM
Citation
 Andrews, SWAronow, SBlake, JFBrandhuber, BJCook, AHaas, JJiang, YKolakowski, GRMcFaddin, EAMcKenney, MLMcNulty, OTMetcalf, ATMoreno, DATang, TPRen, L Substituted pyrazolo[1,5-a]pyridine compounds as RET kinase inhibitors US Patent  US10953005 Publication Date 3/23/2021 
Target
Name:
Proto-oncogene tyrosine-protein kinase receptor Ret [658-1114,V804M]
Synonyms:
CDHF12 PTC Proto-oncogene tyrosine-protein kinase receptor Ret (V804M) RET Kinase (V804M) (aa658-end) RET_HUMAN
Type:
Enzyme Catalytic Domain
Mol. Mass.:
51567.23
Organism:
Homo sapiens (Human)
Description:
P07949[658-1114,V804M]
Residue:
457
  
Inhibitor
Name:
BDBM296543
Synonyms:
US10112942, Example 277 US10172851, Example 277 US10953005, Example 277
Type:
Small organic molecule
Emp. Form.:
C29H30FN7O3
Mol. Mass.:
543.592
SMILES:
CC(C)(O)COc1cc(-c2ccc(nc2)N2CCN(CC2)C(=O)C(N)c2ccc(F)cc2)c2c(cnn2c1)C#N
: