Target
Lysine-specific histone demethylase 1A
Ligand
BDBM243415
Substrate
Meas. Tech.
Inhibitory Activity Assay
IC50
<100.0±n/a nM
Citation
 Matsumoto, SHattori, YToyofuku, MMorimoto, SDaini, MKojima, TKaku, TIto, M Cyclopropanamine compound and use thereof US Patent  US10968213 Publication Date 4/6/2021 
Target
Name:
Lysine-specific histone demethylase 1A
Synonyms:
AOF2 Flavin-containing amine oxidase domain-containing protein 2 KDM1A KIAA0601 Lysine-specific demethylase 1 (LSD1) Lysine-specific histone demethylase 1 (LSD1)
Type:
Enzyme
Mol. Mass.:
92901.01
Organism:
Homo sapiens (Human)
Description:
O60341
Residue:
852
  
Inhibitor
Name:
BDBM243415
Synonyms:
N-(5-methyl-1,3,4- thiadiazol-2-yl)-5- ((1R,2R)-2- (tetrahydro-2H- pyran-4-ylamino)- cyclopropyl)thio- phene-3-carboxamide US10414761, Example 49 US9718814, 49 | US9920047, 49
Type:
Small organic molecule
Emp. Form.:
C16H20N4O2S2
Mol. Mass.:
364.486
SMILES:
Cc1nnc(NC(=O)c2csc(c2)[C@@H]2C[C@H]2NC2CCOCC2)s1
: