Target
Amine oxidase [flavin-containing] A
Ligand
BDBM243417
Substrate
Meas. Tech.
Inhibitory Activity Assay
IC50
>100000±n/a nM
Citation
 Matsumoto, SHattori, YToyofuku, MMorimoto, SDaini, MKojima, TKaku, TIto, M Cyclopropanamine compound and use thereof US Patent  US10968213 Publication Date 4/6/2021 
Target
Name:
Amine oxidase [flavin-containing] A
Synonyms:
AOFA_HUMAN MAO-A Monoamine oxidase Monoamine oxidase type A (MAO A) Monoamine oxidase type A (MAOA)
Type:
Protein
Mol. Mass.:
59689.53
Organism:
Homo sapiens (Human)
Description:
P21397
Residue:
527
  
Inhibitor
Name:
BDBM243417
Synonyms:
N-(4,4- difluorocyclohexyl)- 5-((1R,2R)-2- ((tetrahydro-2H- pyran-4-ylmethyl)- amino)cyclopropyl)- thiophene-3- carboxamide US10414761, Example 51 US9718814, 51 | US9920047, 51
Type:
Small organic molecule
Emp. Form.:
C20H28F2N2O2S
Mol. Mass.:
398.51
SMILES:
FC1(F)CCC(CC1)NC(=O)c1csc(c1)[C@@H]1C[C@H]1NCC1CCOCC1
: