Target
Lysine-specific histone demethylase 1A
Ligand
BDBM256677
Substrate
Meas. Tech.
Inhibitory Activity Assay
IC50
<100.0±n/a nM
Citation
 Matsumoto, SHattori, YToyofuku, MMorimoto, SDaini, MKojima, TKaku, TIto, M Cyclopropanamine compound and use thereof US Patent  US10968213 Publication Date 4/6/2021 
Target
Name:
Lysine-specific histone demethylase 1A
Synonyms:
AOF2 Flavin-containing amine oxidase domain-containing protein 2 KDM1A KIAA0601 Lysine-specific demethylase 1 (LSD1) Lysine-specific histone demethylase 1 (LSD1)
Type:
Enzyme
Mol. Mass.:
92901.01
Organism:
Homo sapiens (Human)
Description:
O60341
Residue:
852
  
Inhibitor
Name:
BDBM256677
Synonyms:
US10053456, 56 US10968213, Example 56 US9718814, 56 | US9920047, 56
Type:
Small organic molecule
Emp. Form.:
C17H24N2O2S
Mol. Mass.:
320.45
SMILES:
O=C(NC1CC1)c1csc(c1)[C@@H]1C[C@H]1NCC1CCOCC1
: