Target
Sodium/glucose cotransporter 1
Ligand
BDBM493901
Substrate
Meas. Tech.
Inhibitory Activity Assay
IC50
1.30±n/a nM
Citation
 Miura, THirashima, SManabe, TIida, TSakurai, K Pyrazole compounds substituted with heteroaryl and pharmaceutical use thereof US Patent  US10988462 Publication Date 4/27/2021 
Target
Name:
Sodium/glucose cotransporter 1
Synonyms:
High affinity sodium-glucose cotransporter Na(+)/glucose cotransporter 1 SGLT1 Sodium-dependent glucose cotransporter 1 (SGLT1) Sodium/glucose cotransporter 1 (SGLT1) | Solute carrier family 5 member 1
Type:
Protein
Mol. Mass.:
73503.78
Organism:
Homo sapiens (Human)
Description:
P13866
Residue:
664
  
Inhibitor
Name:
BDBM493901
Synonyms:
US10988462, Example 17
Type:
Small organic molecule
Emp. Form.:
C24H22ClF4N5O3
Mol. Mass.:
539.91
SMILES:
C[C@@H]1[C@H](CNC1=O)C(=O)Nc1cc(-c2cc(F)cc(OC(C)(C)C(F)(F)F)c2)n(n1)-c1cncc(Cl)c1
: