Target
Epidermal growth factor receptor [T790M,L858R]
Ligand
BDBM495016
Substrate
Meas. Tech.
TR-FRET Assay for ERBB Kinases
IC50
0.670±n/a nM
Citation
 Crew, APZimmermann, KWang, JCrews, CMJaime-Figueroa, SBurslem, G EGFR proteolysis targeting chimeric molecules and associated methods of use US Patent  US10994015 Publication Date 5/4/2021 
Target
Name:
Epidermal growth factor receptor [T790M,L858R]
Synonyms:
EGFR EGFR_HUMAN ERBB1 Epidermal growth factor receptor (EGFR)(T790M/L858R) Epidermal growth factor receptor (T790M, L858R) Epidermal growth factor receptor(L858R, T790M) | HER1
Type:
Mol. Mass.:
134353.72
Organism:
Homo sapiens (Human)
Description:
P00533[T790M,L858R]
Residue:
1210
  
Inhibitor
Name:
BDBM495016
Synonyms:
US10994015, Example 312
Type:
Small organic molecule
Emp. Form.:
C42H47N13O6S
Mol. Mass.:
861.971
SMILES:
CC(C)n1nc(N2CCN(CC3CCN(CC3)c3ccc4C(=O)N(C5CCC(=O)NC5=O)C(=O)c4c3)CC2)c2cnc(Nc3ccnc(n3)-c3cnn(c3)S(=O)(=O)C3CC3)cc12
: