Target
3-phosphoinositide-dependent protein kinase 1
Ligand
BDBM17052
Substrate
Serine/threonine-protein kinase AKT2
Meas. Tech.
PDK1-mediated AKT2 Activation Assay (cAKT2 33P-SPA)
pH
7.2±n/a
Temperature
295.15±n/a K
IC50
12±n/a nM
Citation
 Feldman, RIWu, JMPolokoff, MAKochanny, MJDinter, HZhu, DBiroc, SLAlicke, BBryant, JYuan, SBuckman, BOLentz, DFerrer, MWhitlow, MAdler, MFinster, SChang, ZArnaiz, DO Novel small molecule inhibitors of 3-phosphoinositide-dependent kinase-1. J Biol Chem 280:19867-74 (2005)  
Target
Name:
3-phosphoinositide-dependent protein kinase 1
Synonyms:
3-Phosphoinositide-Dependent Protein Kinase 1 (PDK1) 3-phosphoinositide-dependent protein kinase 1 3-phosphoinositide-dependent protein kinase 1 (PDK-1) Isoform 2 of 3-phosphoinositide-dependent protein kinase 1 PDPK1 Phosphoinositide-dependent protein kinase 1 (PDK1) hPDK1
Type:
Enzyme
Mol. Mass.:
63157.65
Organism:
Homo sapiens (Human)
Description:
O15530
Residue:
556
  
Inhibitor
Name:
BDBM17052
Synonyms:
BX-912 | N-{3-[(5-bromo-4-{[2-(1H-imidazol-4-yl)ethyl]amino}pyrimidin-2-yl)amino]phenyl}pyrrolidine-1-carboxamide
Type:
Small organic molecule
Emp. Form.:
C20H23BrN8O
Mol. Mass.:
471.354
SMILES:
Brc1cnc(Nc2cccc(NC(=O)N3CCCC3)c2)nc1NCCc1cnc[nH]1
:
Substrate
Name:
RAC-beta serine/threonine-protein kinase
Synonyms:
AKT2 PKB beta Protein kinase B (Akt 2) Protein kinase B, beta RAC-alpha serine/threonine-protein kinase (AKT2) RAC-beta serine/threonine-protein kinase (AKT2) Serine/threonine-protein kinase AKT2 | Serine/threonine-protein kinase Rac alpha/beta
Type:
Enzyme
Mol. Mass.:
55766.64
Organism:
Homo sapiens (Human)
Description:
Residue:
481