Target
Transient receptor potential cation channel subfamily V member 1
Ligand
BDBM20472
Substrate
BDBM10852
Meas. Tech.
FLIPR (Fluorescence Imaging Plate Reader)-Based Ca2+ Assay
pH
7.2±n/a
Temperature
298.15±n/a K
EC50
20±n/a nM
Citation
 Rami, HKThompson, MWyman, PJerman, JCEgerton, JBrough, SStevens, AJRandall, ADSmart, DGunthorpe, MJDavis, JB Discovery of small molecule antagonists of TRPV1. Bioorg Med Chem Lett 14:3631-4 (2004)  
Target
Name:
Transient receptor potential cation channel subfamily V member 1
Synonyms:
Capsaicin receptor Osm-9-like TRP channel 1 TRPV1_HUMAN Transient receptor potential cation channel subfamily V member 1 (TRPV1) Transient receptor potential cation channel subfamily V member 1(TRPV1) Vanilloid VR1 Vanilloid receptor 1 Vanilloid receptor 1 (VRI/TRPV1)
Type:
Protein
Mol. Mass.:
94960.75
Organism:
Homo sapiens (Human)
Description:
Q8NER1
Residue:
839
  
Inhibitor
Name:
BDBM20472
Synonyms:
1-(2-chlorophenyl)-3-{2-[ethyl(3-methylphenyl)amino]ethyl}urea | urea TRPV1 antagonist, 4
Type:
Small organic molecule
Emp. Form.:
C18H22ClN3O
Mol. Mass.:
331.84
SMILES:
CCN(CCNC(=O)Nc1ccccc1Cl)c1cccc(C)c1
:
Substrate