Target
Corticotropin-releasing factor receptor 1
Ligand
BDBM20978
Substrate
125I-Tyr(0)-ovine-CRF
Meas. Tech.
Receptor Binding Assay
pH
7±n/a
Temperature
296.15±n/a K
IC50
2.2±0.11 nM
Citation
 Dzierba, CDTebben, AJWilde, RGTakvorian, AGRafalski, MKasireddy-Polam, PKlaczkiewicz, JDPechulis, ADDavis, ALSweet, MPWoo, AMYang, ZEbeltoft, SMMolski, TFZhang, GZaczek, RCTrainor, GLCombs, APGilligan, PJ Dihydropyridopyrazinones and dihydropteridinones as corticotropin-releasing factor-1 receptor antagonists: structure-activity relationships and computational modeling. J Med Chem 50:2269-72 (2007)  
Target
Name:
Corticotropin-releasing factor receptor 1
Synonyms:
CRF-R CRFR1_RAT Corticotropin releasing factor receptor Corticotropin-releasing Factor Receptor 1 Crhr | Crhr1
Type:
G Protein-Coupled Receptor (GPCR)
Mol. Mass.:
47870.75
Organism:
Rattus norvegicus (rat)
Description:
Receptor binding assays were performed using rat cortex homogenate.
Residue:
415
  
Inhibitor
Name:
BDBM20978
Synonyms:
N-butyl-4-(2,6-dimethoxypyridin-3-yl)-N-ethyl-6-methyl-1H,2H,3H,4H-pyrido[2,3-b]pyrazin-8-amine | Pyridopyrazine, 2b
Type:
Small organic molecule
Emp. Form.:
C21H31N5O2
Mol. Mass.:
385.5031
SMILES:
CCCCN(CC)c1cc(C)nc2N(CCNc12)c1ccc(OC)nc1OC
:
Substrate
Name:
125I-Tyr(0)-ovine-CRF
Synonyms:
Ovine Tyr-CRF | oCRF
Type:
radiolabeled substrate
Mol. Mass.:
4833.46
Organism:
Ovis aries (sheep)
Description:
Residue:
42